{"text_format":"1","workbook":"xlsx","n_sheets":14,"sheets":["Reporte general","Avance Metas","Para informe. Avance PED-PI","Para informe","Consolidado","Base F. Indicador","Indicadores","Avance Lineamientos","Ficha Indicador","Base L1","Base L5","Base L2","Base L3","Base L4"],"not_rendered":{"charts":17,"images":26,"macros":1,"external_links":1,"defined_names":11,"comments":3,"pivot_tables":0},"unopened":[],"bounds":{"document_bytes":16777216,"sheet_cells":100000,"rows_first":2000,"rows_last":500,"rows_between":2000,"halvings":0,"cell_chars":16384,"cell_head_chars":4096},"cells_cut":0,"cells_raw":0,"read":"whole","date_system":"1900"}

{"sheet":"Reporte general","index":0,"n_rows":100,"n_cols":12,"rows_kept":100,"cut":false,"hidden":false,"merged":[[97,3,99,3],[50,2,50,6],[50,7,50,11],[61,2,61,6],[61,7,61,11],[74,2,74,6],[74,7,74,11],[86,2,86,6],[86,7,86,11],[1,4,5,9],[1,10,5,11],[30,2,30,6],[30,7,30,11],[20,3,20,4],[21,3,21,4],[22,3,22,4],[19,3,19,4],[18,3,18,4],[17,2,17,4],[10,2,12,11],[14,2,15,11],[1,2,5,3]]}
[]
[]
[]
[]
[]
[]
{"$rows_left_out":95}
{"sheet":"Avance Metas","index":1,"n_rows":32,"n_cols":21,"rows_kept":32,"cut":false,"hidden":false,"merged":[[1,1,5,2],[1,3,5,9],[1,10,5,11],[14,2,14,3],[12,1,12,3],[10,2,10,11],[12,5,12,11],[14,5,18,11],[25,14,25,18],[20,7,20,11],[20,1,20,5],[15,2,15,3],[16,2,16,3],[17,2,17,3],[18,2,18,3]]}
[]
[]
[]
[]
[]
[]
{"$rows_left_out":27}
{"sheet":"Para informe. Avance PED-PI","index":2,"n_rows":94,"n_cols":16,"rows_kept":94,"cut":false,"hidden":true,"merged":[[4,12,4,15],[38,1,49,1],[47,3,49,3],[2,2,2,6],[4,1,4,6],[6,1,19,1],[20,1,24,1],[25,1,31,1],[32,1,37,1],[4,8,4,11],[4,7,5,7]]}
[]
[]
[]
[]
[null,"Información de la Meta Estraté",null,null,null,null,null,"Reporte 2020","Plan Indicativo 2018-2030",null,null,null,"Plan Estratégico de Desarrollo 2018-2030"]
[null,"L","N°","Meta ","Indicador ","Unidad de medida","Linea base (2017)",null,"Meta 2021","Avance a corte 2020",null,"Faltante","Meta 2030","Avance a corte 2020",null,"Faltante"]
{"$rows_left_out":89}
{"sheet":"Para informe","index":3,"n_rows":95,"n_cols":20,"rows_kept":95,"cut":false,"hidden":true,"merged":[[2,1,2,5],[34,1,34,5],[22,1,22,5],[47,1,47,5],[59,1,59,5],[72,2,74,2],[4,1,4,5],[4,6,4,8],[24,1,24,5],[24,6,24,8],[36,1,36,5],[36,6,36,8],[49,1,49,5],[49,6,49,8],[61,1,61,5],[61,6,61,8],[72,16,74,16],[72,13,74,13],[72,19,74,19],[4,11,4,13],[24,11,24,13],[36,11,36,13],[49,11,49,13],[61,11,61,13],[72,18,74,18]]}
[]
[]
[null,"Lineamiento Estratégico 1"]
[]
[null,"Información del indicador ",null,null,null,null,"Información del indicador ",null,null,null,null,"Información del indicador ",null,null,null,null,null,null,null,"Cumplimiento "]
[null,"N°","Meta ","Indicador ","Unidad de medida","Linea base (2017)","Metas 2020","Reportado 2020","% cumplimiento 2020",null,null,"Metas 2020","Reportado 2020","% cumplimiento 2020",null,"N°","Meta ",null,null,"% cumplimiento 2020"]
{"$rows_left_out":90}
{"sheet":"Consolidado","index":4,"n_rows":55,"n_cols":23,"rows_kept":55,"cut":false,"hidden":true,"merged":[[1,14,1,16],[1,17,1,19]]}
[]
[null,null,null,null,null,null,null,null,null,null,null,null,null,null,"Plan Indicativo",null,null,"Plan Estratégico de Desarrollo"]
[null,"L","N°","Meta","Indicador","Metas 2018","Reportado 2018","% cumplimiento 2018","Metas 2019","Reportado 2019","% cumplimiento 2019","Metas 2020","Reportado 2020","% cumplimiento 2020","Meta año 2021","Cumplimiento respecto Indicativo 2018","Cumplimiento respecto Indicativo 2019","Meta año 2030","Cumplimiento respecto Indicativo 2018","Cumplimiento respecto Indicativo 2019","Linea base","Unidad del Indicador","Unidades responsables "]
[null,"L1",1,"1. Mantener y elevar la acreditación institucional de alta calidad y alcanzar el reconocimiento internacional.","Documento de Resolución MEN Acreditación Institucional",{"$f":"'Base L1'!O6","v":0},{"$f":"'Base L1'!P6","v":0},"-",{"$f":"'Base L1'!R6","v":0},{"$f":"'Base L1'!S6","v":0},"-",{"$f":"'Base L1'!U6","v":0},{"$f":"'Base L1'!V6","v":0}," -",null,null,null,"Acreditación Institucional Vigente",null,null,"Universidad Acreditada","Número","Coordinación General de Autoevaluación y Acreditación"]
[null,"L1",2,"2. Aumentar el 34% en el número de estudiantes de pregrado matriculados.","(M1semPre + M2semPre)/2",{"$f":"'Base L1'!O7","v":23886},{"$f":"'Base L1'!P7","v":24006},{"$f":"IF(F5=0,1,IF(G5/F5>1,1,G5/F5))","v":1},{"$f":"'Base L1'!R7","v":25465},{"$f":"'Base L1'!S7","v":24624},{"$f":"IF(I5=0,1,IF(J5/I5>1,1,J5/I5))","v":0.96697427842136263},{"$f":"'Base L1'!U7","v":27108},{"$f":"'Base L1'!V7","v":25992.5},{"$f":"'Base L1'!W7","v":0.95884978604102111},29007,{"$f":"G5/O5","v":0.82759333953873204},{"$f":"J5/O5","v":0.84889854173130619},32000,{"$f":"G5/R5","v":0.75018750000000001},{"$f":"J5/R5","v":0.76949999999999996},23862,"Número","Decanaturas de Facultad"]
[null,"L1",3,"3. Aumentar el 65% de estudiantes matriculados en posgrado.","(M1semPos + M2semPos)/2",{"$f":"'Base L1'!O8","v":2996},{"$f":"'Base L1'!P8","v":3055},1,{"$f":"'Base L1'!R8","v":3191},{"$f":"'Base L1'!S8","v":3222},1,{"$f":"'Base L1'!U8","v":3417},{"$f":"'Base L1'!V8","v":3274},{"$f":"'Base L1'!W8","v":0.95815042434884401},3667,{"$f":"G6/O6","v":0.83310608126533947},{"$f":"J6/O6","v":0.87864739569130079},4904,{"$f":"G6/R6","v":0.62296084828711251},{"$f":"J6/R6","v":0.65701468189233281},2972,"Número","Decanaturas de Facultad"]
{"$rows_left_out":50}
{"sheet":"Base F. Indicador","index":5,"n_rows":48,"n_cols":24,"rows_kept":48,"cut":false,"hidden":true,"merged":[[2,7,2,9],[2,10,2,12],[1,1,1,21]]}
[null,1,2,3,4,5,6,7,8,9,10,11,12,13,14,15,16,17,18,19,20,21,22,23]
[null,"Base de datos Ficha de Indicadores"]
[null,null,null,null,null,null,null,"Variable 1",null,null,"Variable 2"]
[null,"Meta ","Lineamiento ","N°","Estrategias asociadas","Indicador ","Unidad de medida","Nombre","Unidad medida","Fuente de la Información ","Nombre","Unidad medida","Fuente de la Información ","Línea base (2017)","Tipo de indicador ","Meta 2030","Convenciones","Unidades responsables ","Fuente de la información",null,"Definiciones","Periodicidad","Criterios y observaciones sobre el Indicador"]
[{"$f":"D5&\". \"&B5","v":"1. Mantener y elevar la acreditación institucional de alta calidad y alcanzar el reconocimiento internacional."},"Mantener y elevar la acreditación institucional de alta calidad y alcanzar el reconocimiento internacional.","1. Formar ciudadanos, profesionales, investigadores, creadores e innovadores, íntegros con pensamiento crítico y cultura democrática, en contextos diferenciados inter y multiculturales para la transformación de la sociedad.",1," - Difusión y apropiación del Proyecto Universitario Institucional.\n - Desarrollar de manera permanente procesos de autoevaluación que se traduzcan en planes de mejoramiento continuo.\n - Elevar el nivel de desempeño de los estudiantes en las pruebas Saber Pro.","Documento de Resolución MEN Acreditación Institucional","Documento de Resolución MEN Acreditación Institucional",{"$f":"F5","v":"Documento de Resolución MEN Acreditación Institucional"},"Documento MEN","Coordinación General de Autoevaluación y Acreditación"," -"," - "," -","Universidad Acreditada","Cualitativo  ","Acreditación Institucional Vigente"," - ",{"$f":"VLOOKUP(B5,Indicadores!D7:K89,6,FALSE)","v":"Coordinación General de Autoevaluación y Acreditación"}," -",null," - Acreditación:  Proceso mediante el cual una institución o programa educativo obtiene un reconocimiento de alta calidad.","Anual"," -"]
[{"$f":"D6&\". \"&B6","v":"2. Aumentar el 34% en el número de estudiantes de pregrado matriculados."},"Aumentar el 34% en el número de estudiantes de pregrado matriculados.","1. Formar ciudadanos, profesionales, investigadores, creadores e innovadores, íntegros con pensamiento crítico y cultura democrática, en contextos diferenciados inter y multiculturales para la transformación de la sociedad.",2," - Consolidación de una oferta académica flexible que articule todas las metodologías de enseñanza, los niveles y los campos de formación, permitiendo el aumento y fortalecimiento de la oferta existente, articulada con la educación básica, media y superior.","(M1semPre + M2semPre) /2","Número de estudiantes matriculados en pregrado","Número de estudiantes matriculados en pregrado (Periodo I) ","Estudiantes","Spagobi - Sistema de Gestión Académica","Número de estudiantes matriculados en pregrado (Periodo III) ","Estudiantes","Spagobi - Sistema de Gestión Académica",23862,"Cuantitativo",32000," - M1semPre: Número de estudiantes matriculados semestre I en pregrado.\n - M2semPre: Número de estudiantes matriculados semestre III en pregrado.",{"$f":"VLOOKUP(B6,Indicadores!D8:K90,6,FALSE)","v":"Decanaturas de Facultad"}," -",null," -","Anual","En el reporte del indicador se tendrá en cuenta el pico más alto de estudiantes matriculados de cada periodo. "]
{"$rows_left_out":43}
{"sheet":"Indicadores","index":6,"n_rows":89,"n_cols":16,"rows_kept":89,"cut":false,"hidden":true,"merged":[[50,8,52,8],[53,8,55,8],[57,8,63,8],[70,8,71,8],[75,8,77,8],[78,8,81,8],[78,10,81,10],[82,4,83,4],[86,2,88,2],[86,3,88,3],[86,4,88,4],[75,10,77,10],[78,2,81,2],[78,3,81,3],[78,5,81,5],[78,6,81,6],[78,7,81,7],[78,9,81,9],[65,10,67,10],[70,10,71,10],[57,10,63,10],[65,7,67,7],[65,9,67,9],[57,9,63,9],[72,1,88,1],[73,4,74,4],[75,2,77,2],[75,3,77,3],[75,5,77,5],[75,6,77,6],[75,7,77,7],[75,9,77,9],[70,9,71,9],[57,1,71,1],[57,2,63,2],[57,3,63,3],[57,5,63,5],[57,6,63,6],[57,7,63,7],[70,2,71,2],[70,3,71,3],[70,5,71,5],[70,6,71,6],[70,7,71,7],[65,2,67,2],[65,3,67,3],[65,5,67,5],[65,6,67,6],[65,8,67,8],[40,1,56,1],[40,2,41,2],[40,3,41,3],[43,5,47,5],[43,6,47,6],[43,7,47,7],[43,9,47,9],[53,10,55,10],[53,2,55,2],[53,3,55,3],[53,5,55,5],[53,6,55,6],[53,7,55,7],[53,9,55,9],[48,10,49,10],[50,2,52,2],[50,3,52,3],[50,5,52,5],[50,6,52,6],[50,7,52,7],[50,9,52,9],[50,10,52,10],[43,2,47,2],[43,3,47,3],[40,5,41,5],[40,6,41,6],[40,7,41,7],[40,9,41,9],[43,10,47,10],[48,2,49,2],[48,3,49,3],[48,5,49,5],[48,6,49,6],[48,7,49,7],[48,9,49,9],[40,10,41,10],[40,8,41,8],[43,8,47,8],[48,8,49,8],[37,10,39,10],[29,10,31,10],[32,2,34,2],[32,3,34,3],[32,5,34,5],[32,6,34,6],[32,7,34,7],[32,9,34,9],[29,9,31,9],[32,10,34,10],[37,9,39,9],[29,8,31,8],[32,8,34,8],[37,8,39,8],[29,1,39,1],[29,2,31,2],[29,3,31,3],[29,5,31,5],[29,6,31,6],[29,7,31,7],[37,2,39,2],[37,3,39,3],[37,5,39,5],[37,6,39,6],[37,7,39,7],[24,2,27,2],[24,3,27,3],[24,5,27,5],[24,6,27,6],[24,7,27,7],[24,8,27,8],[24,9,27,9],[22,9,23,9],[22,2,23,2],[22,3,23,3],[14,6,15,6],[14,7,15,7],[14,8,15,8],[14,9,15,9],[17,6,18,6],[17,7,18,7],[17,8,18,8],[17,9,18,9],[24,10,27,10],[22,10,23,10],[6,10,9,10],[10,4,11,4],[12,4,13,4],[14,2,15,2],[14,3,15,3],[14,5,15,5],[14,10,15,10],[6,1,28,1],[6,2,9,2],[6,3,9,3],[6,5,9,5],[6,6,9,6],[6,7,9,7],[6,8,9,8],[6,9,9,9],[20,4,21,4],[17,2,18,2],[17,3,18,3],[17,5,18,5],[22,5,23,5],[22,6,23,6],[22,7,23,7],[22,8,23,8],[17,10,18,10],[1,1,1,10],[3,1,3,4],[3,5,3,10],[4,1,5,1],[4,2,4,3],[4,4,5,4],[4,5,5,5],[4,6,5,6],[4,7,5,7],[4,8,5,8],[4,9,5,9]]}
[]
[null,"INSTRUMENTO DE SEGUIMIENTO Y EVALUACIÓN PED 2018-2030"]
[]
[null,"PLAN ESTRATÉGICO DE DESARROLLO 2018-2030",null,null,null,"SEGUIMIENTO",null,null,null,null,null,null,"Vigencias","Metas","Lineamientos","Metas"]
[null,"Lineamiento","Metas",null,"Estrategias","Indicador","Unida de Medida","Línea Base       (cierre 2017)","Unidades responsables","Meta 2030",null,null,2018,"1. Mantener y elevar la acreditación institucional de alta calidad y alcanzar el reconocimiento internacional.","1. Formar ciudadanos, profesionales, investigadores, creadores e innovadores, íntegros con pensamiento crítico y cultura democrática, en contextos diferenciados inter y multiculturales para la transformación de la sociedad.","2. Aumentar el 34% en el número de estudiantes de pregrado matriculados."]
[null,null,"No.","Descripción",null,null,null,null,null,null,2030,null,2019,"2. Aumentar el 34% en el número de estudiantes de pregrado matriculados.","2. Establecer un diseño curricular dinámico y flexible que promueva el pluralismo y consolide una comunidad universitaria crítica transformadora y en armonía ambiental.","3. Aumentar el 65% de estudiantes matriculados en posgrado."]
{"$rows_left_out":84}
{"sheet":"Avance Lineamientos","index":7,"n_rows":42,"n_cols":18,"rows_kept":42,"cut":false,"hidden":true,"merged":[[1,11,5,12],[21,3,21,12],[10,6,10,12],[12,6,16,12],[27,2,27,6],[1,4,5,10],[23,8,23,12],[1,1,5,3],[23,1,23,6],[26,2,26,6],[25,1,25,6],[21,1,21,2],[25,8,39,12],[38,2,38,6],[39,2,39,6],[10,1,10,4],[12,1,16,4],[37,2,37,6],[33,2,33,6],[34,2,34,6],[35,2,35,6],[36,2,36,6],[28,2,28,6],[29,2,29,6],[30,2,30,6],[31,2,31,6],[32,2,32,6]]}
[]
[]
[]
[]
[]
[]
{"$rows_left_out":37}
{"sheet":"Ficha Indicador","index":8,"n_rows":26,"n_cols":16,"rows_kept":26,"cut":false,"hidden":false,"merged":[[15,1,15,2],[24,1,24,12],[17,9,17,12],[18,1,19,5],[18,6,19,8],[18,9,19,12],[25,1,25,12],[22,1,22,12],[10,3,10,12],[12,3,12,12],[13,3,13,12],[23,1,23,12],[20,1,21,5],[20,6,21,8],[20,9,21,12],[16,1,16,12],[17,1,17,5],[14,1,14,2],[14,10,14,12],[17,6,17,8],[15,3,15,8],[15,10,15,12],[1,1,3,2],[1,11,3,12],[1,3,3,10],[14,5,14,6],[14,7,14,8],[9,1,9,2],[11,1,11,12],[10,1,10,2],[9,4,9,12],[7,1,7,12],[8,1,8,2],[8,3,8,12],[12,1,12,2],[13,1,13,2],[14,3,14,4],[5,3,5,10]]}
[null,null,null,null,null,null,null,null,null,null,null,null," "]
[]
[]
[]
[]
[null,null,{"$f":"D10","v":2},"HOJA DE VIDA DEL INDICADOR"]
{"$rows_left_out":21}
{"sheet":"Base L1","index":9,"n_rows":255,"n_cols":25,"rows_kept":255,"cut":false,"hidden":true,"merged":[[1,1,1,22],[92,7,92,11],[126,7,126,11],[160,7,160,11],[3,1,3,5],[21,1,21,12],[24,7,24,11],[19,12,19,13],[3,12,4,12],[3,13,4,13],[3,6,3,10],[58,7,58,11],[248,7,248,11],[169,7,169,11],[178,7,178,11],[212,7,212,11],[221,7,221,11],[230,7,230,11],[239,7,239,11]]}
[]
[null,"L I N E A M I E N T O  1"]
[]
[null,"Información del indicador ",null,null,null,null,"Reporte de los indicadores ",null,null,null,null,null,"N°","Meta ","Avance PLAN INDICATIVO "]
[null,"N°","Meta ","Indicador ","Unidad de medida","Linea base (2017)",2018,2019,2020,2021,"Tendencia",null,null,null,"Metas 2018","Reportado 2018","% cumplimiento 2018","Metas 2019","Reportado 2019","% cumplimiento 2019","Metas 2020","Reportado 2020","% cumplimiento 2020",null,2021]
[null,1,"Mantener y elevar la acreditación institucional de alta calidad y alcanzar el reconocimiento internacional.","Documento de Resolución MEN Acreditación Institucional","Documento de Resolución MEN Acreditación Institucional","Universidad Acreditada",null,null,null,null," ",null,1,{"$f":"C6","v":"Mantener y elevar la acreditación institucional de alta calidad y alcanzar el reconocimiento internacional."}]
{"$rows_left_out":250}
{"sheet":"Base L5","index":10,"n_rows":127,"n_cols":25,"rows_kept":127,"cut":false,"hidden":true,"merged":[[3,14,3,22],[1,1,1,11],[3,1,3,5],[18,1,18,12],[3,6,3,10],[3,12,4,12],[3,13,4,13],[14,13,16,13],[120,7,120,11],[48,7,48,11],[57,7,57,11],[66,7,66,11],[75,7,75,11],[84,7,84,11],[93,7,93,11],[21,7,21,11],[30,7,30,11],[39,7,39,11],[102,7,102,11],[111,7,111,11]]}
[]
[null,"L I N E A M I E N T O  5"]
[]
[null,"Información del indicador ",null,null,null,null,"Reporte de los indicadores ",null,null,null,null,null,"N°","Meta ","Avance PLAN INDICATIVO "]
[null,"N°","Meta ","Indicador ","Unidad de medida","Linea base (2017)",2018,2019,2020,2021,"Tendencia",null,null,null,"Metas 2018","Reportado 2018","% cumplimiento 2018","Metas 2019","Reportado 2019","% cumplimiento 2019","Metas 2020","Reportado 2020","% cumplimiento 2020",null,2021]
[null,33,"Implementar los dominios identificados en el marco de referencia IT 4+ establecidos por MinTIC","∑ Dominios implementados según Marco de referencia IT4+","Dominios implementados según Marco de referencia IT4+",0,{"$f":"$J$25","v":0},{"$f":"$J$26","v":0},{"$f":"$J$27","v":0},{"$f":"$J$28","v":0},null,null,{"$f":"B6","v":33},{"$f":"C6","v":"Implementar los dominios identificados en el marco de referencia IT 4+ establecidos por MinTIC"},{"$f":"$I$25","v":0},{"$f":"$J$25","v":0},{"$f":"IF(O6=0,O6,P6/O6)","v":0},{"$f":"$I$26","v":3},{"$f":"$J$26","v":0},{"$f":"IF(R6=0,R6,S6/R6)","v":0},{"$f":"$I$27","v":4},{"$f":"$J$27","v":0},{"$f":"IF(U6=0,U6,V6/U6)","v":0},null,{"$f":"$I$28","v":6}]
{"$rows_left_out":122}
{"sheet":"Base L2","index":11,"n_rows":82,"n_cols":25,"rows_kept":82,"cut":false,"hidden":true,"merged":[[3,14,3,22],[1,1,1,22],[3,13,4,13],[66,7,66,11],[75,7,75,11],[11,1,11,12],[14,7,14,11],[3,6,3,10],[3,12,4,12],[48,7,48,11],[3,1,3,5],[57,7,57,11]]}
[]
[null,"L I N E A M I E N T O  2"]
[]
[null,"Información del indicador ",null,null,null,null,"Reporte de los indicadores",null,null,null,null,null,"N°","Meta ","Avance PLAN INDICATIVO "]
[null,"N°","Meta ","Indicador ","Unidad de medida","Linea base (2017)",2018,2019,2020,2021,"Tendencia",null,null,null,"Metas 2018","Reportado 2018","% cumplimiento 2018","Metas 2019","Reportado 2019","% cumplimiento 2019","Metas 2020","Reportado 2020","% cumplimiento 2020",null,2021]
[null,15,"Evaluar, revisar y reformular la oferta curricular de pregrado y posgrado de cada facultad, en el marco de los procesos de autoevaluación continua y los proyectos educativos de las facultades.","∑ Programas evaluados curricularmente","Número de proyectos curriculares evaluados y actualizados",81,{"$f":"$J$18","v":81},{"$f":"$J$19","v":81},{"$f":"$J$20","v":81},{"$f":"$J$21","v":0},null,null,{"$f":"B6","v":15},{"$f":"C6","v":"Evaluar, revisar y reformular la oferta curricular de pregrado y posgrado de cada facultad, en el marco de los procesos de autoevaluación continua y los proyectos educativos de las facultades."},{"$f":"$I$18","v":80},{"$f":"$J$18","v":81},{"$f":"IF(P6=0,,(P6/O6))","v":1.0125},{"$f":"$I$19","v":86},{"$f":"$J$19","v":81},{"$f":"IF(S6=0,,(S6/R6))","v":0.94186046511627908},{"$f":"$I$20","v":94},{"$f":"$J$20","v":81},{"$f":"IF(V6=0,,(V6/U6))","v":0.86170212765957444},null,{"$f":"$I$21","v":101}]
{"$rows_left_out":77}
{"sheet":"Base L3","index":12,"n_rows":75,"n_cols":25,"rows_kept":75,"cut":false,"hidden":true,"merged":[[3,13,4,13],[1,1,1,11],[3,1,3,5],[43,7,43,11],[3,14,3,22],[52,7,52,11],[3,6,3,10],[61,7,61,11],[13,1,13,12],[16,7,16,11],[25,7,25,11],[34,7,34,11],[3,12,4,12]]}
[]
[null,"L I N E A M I E N T O  3"]
[]
[null,"Información del indicador ",null,null,null,null,"Reporte de los indicadores",null,null,null,null,null,"N°","Meta ","Avance PLAN INDICATIVO "]
[null,"N°","Meta ","Indicador ","Unidad de medida","Linea base (2017)",2018,2019,2020,2021,"Tendencia",null,null,null,"Metas 2018","Reportado 2018","% cumplimiento 2018","Metas 2019","Reportado 2019","% cumplimiento 2019","Metas 2020","Reportado 2020","% cumplimiento 2020",null,2021]
[null,20,"Clasificarse entre las 5 mejores IES colombianas según indicadores en investigación.","Puesto según Rankings:  US= Usapiens WM= Webometrics ScN= Scimago Nacional ScW= Scimago Internacional","Puesto según Rankings:  US= Usapiens WM= Webometrics ScN= Scimago Nacional ScW= Scimago Internacional","US=  16 \nWM=  18 \nScN=  15 \nScW=  758","US=14\nWM=15\nSCN=21\nSCW=746","US=18\nWM=24\nSCN=25\nSCW=770","US = 17\nWM=  24\nScN=  33\nScW=  808","US= \n WM=  \nScN=  \nScW=  "," ",null,{"$f":"B6","v":20},{"$f":"C6","v":"Clasificarse entre las 5 mejores IES colombianas según indicadores en investigación."},"US= \nWM=  \nScN=  \nScW=  ","US= \nWM=  \nScN=  \nScW=  ",null,"US= \n WM=  \nScN=  \nScW=  ","US= \n WM=  \nScN=  \nScW=  ",null,"US= \n WM=  \nScN=  \nScW=  ","US= \n WM=  \nScN=  \nScW=  ","US= \n WM=  \nScN=  \nScW=  ",null,"US= \n WM=  \nScN=  \nScW=  "]
{"$rows_left_out":70}
{"sheet":"Base L4","index":13,"n_rows":58,"n_cols":25,"rows_kept":58,"cut":false,"hidden":true,"merged":[[3,14,3,22],[3,13,4,13],[1,1,1,11],[3,1,3,5],[51,7,51,11],[42,7,42,11],[12,1,12,12],[15,7,15,11],[24,7,24,11],[33,7,33,11],[3,6,3,10],[3,12,4,12]]}
[]
[null,"L I N E A M I E N T O  4"]
[]
[null,"Información del indicador ",null,null,null,null,"Reporte de los indicadores",null,null,null,null,null,"N°","Meta ","Avance PLAN INDICATIVO "]
[null,"N°","Meta ","Indicador ","Unidad de medida","Linea base (2017)",2018,2019,2020,2021,"Tendencia ",null,null,null,"Metas 2018","Reportado 2018","% cumplimiento 2018","Metas 2019","Reportado 2019","% cumplimiento 2019","Metas 2020","Reportado 2020","% cumplimiento 2020",null,2021]
[null,27,"Ampliar, mejorar y modernizar física, tecnológica y ambientalmente la infraestructura, esto de acuerdo con la proyección de la cobertura y las políticas de inclusión.","∑ Metros cuadrados (m2) construidos ","Total de metros cuadrados (m2) construidos",104609,{"$f":"$J$19","v":104609},{"$f":"$J$20","v":104609},{"$f":"$J$21","v":104609},{"$f":"$J$22","v":0},null,null,{"$f":"B6","v":27},{"$f":"C6","v":"Ampliar, mejorar y modernizar física, tecnológica y ambientalmente la infraestructura, esto de acuerdo con la proyección de la cobertura y las políticas de inclusión."},{"$f":"$I$19","v":104609},{"$f":"$J$19","v":104609},{"$f":"IF(P6=0,,(P6/O6))","v":1},{"$f":"$I$20","v":116509},{"$f":"$J$20","v":104609},{"$f":"IF(S6=0,,(S6/R6))","v":0.89786196774498106},{"$f":"$I$21","v":116509},{"$f":"$J$21","v":104609},{"$f":"IF(V6=0,,(V6/U6))","v":0.89786196774498106},null,{"$f":"$I$21","v":116509}]
{"$rows_left_out":52}